id,item_group_id,title,description,price,sale_price,color,size,link,is_bundle,condition,image_link,additional_image_link,mpn,brand,gender,material,age_group,google_product_category,product_type,availability,multipack,pattern,size_type,custom_label_0,custom_label_1,custom_label_2,custom_label_3,custom_label_4,shipping(country:price),shipping(country:price),shipping(country:price),shipping(country:price),shipping(country:price),shipping(country:price),shipping(country:price),shipping(country:price),shipping(country:price),shipping(country:price),shipping(country:price),shipping(country:price),shipping(country:price),shipping(country:price),shipping(country:price),shipping(country:price),shipping(country:price),shipping(country:price),shipping(country:price),shipping(country:price),shipping(country:price),shipping(country:price),shipping(country:price),shipping(country:price),shipping(country:price),shipping(country:price),shipping(country:price),shipping(country:price),shipping(country:price),shipping(country:price),shipping(country:price),shipping(country:price),shipping(country:price),shipping(country:price),shipping(country:price),shipping(country:price),shipping(country:price),shipping(country:price),shipping(country:price),shipping(country:price),shipping(country:price),shipping(country:price),shipping(country:price),shipping(country:price),shipping(country:price),shipping(country:price),shipping(country:price),shipping(country:price),shipping(country:price),shipping(country:price),shipping(country:price),shipping(country:price),shipping(country:price),shipping(country:price),shipping(country:price),shipping(country:price),shipping(country:price),shipping(country:price),shipping(country:price),shipping(country:price),shipping(country:price),shipping(country:price),shipping(country:price),shipping(country:price),shipping(country:price),shipping(country:price),shipping(country:price),shipping(country:price),shipping(country:price),shipping(country:price),shipping(country:price),shipping(country:price),shipping(country:price),shipping(country:price),shipping(country:price),shipping(country:price),shipping(country:price),shipping(country:price),shipping(country:price),shipping(country:price),shipping(country:price),shipping(country:price),shipping(country:price),shipping(country:price),shipping(country:price)
4700271,4700271,"Group survivor pack","Survivor mini-me pack","98 GBP",,,,https://atheleisurecs.teemill.com/product/group-survivor-pack/?currency=GBP,yes,new,https://images.teemill.com/ge4gnvojzomuddourjcuzwbm8yvovsntjpr5lvxe9ftsqcm9.png.jpg?w=auto&h=auto,,BUNDLE-4700271,AtheleisureCS,male,,Adult,"Clothing & Accessories > Clothing","Printed T-shirt > Male > Pack > AtheleisureCS","in stock",,,,"Male - Printed T-shirt",1,0,1,,"US:6.5 GBP","CA:6.5 GBP","AU:6.5 GBP","FR:7 GBP","DE:7 GBP","IS:6.5 GBP","IE:7 GBP","IT:7 GBP","ES:7 GBP","SE:7 GBP","AT:7 GBP","BE:7 GBP","FI:7 GBP","CZ:7 GBP","DK:7 GBP","NO:6.5 GBP","GB:0.00 GBP","CH:6.5 GBP","NZ:6.5 GBP","PT:7 GBP","NL:7 GBP","IM:4.5 GBP","DZ:6.5 GBP","AD:6.5 GBP","AR:6.5 GBP","AM:6.5 GBP","BH:6.5 GBP","BD:6.5 GBP","BM:6.5 GBP","BG:7 GBP","CV:6.5 GBP","CL:6.5 GBP","CN:6.5 GBP","CR:6.5 GBP","HR:7 GBP","CY:7 GBP","EG:6.5 GBP","EE:7 GBP","FK:6.5 GBP","FO:6.5 GBP","GE:6.5 GBP","GI:6.5 GBP","GR:7 GBP","GL:6.5 GBP","GG:4.5 GBP","HK:6.5 GBP","HU:7 GBP","IN:6.5 GBP","ID:6.5 GBP","IL:6.5 GBP","JP:6.5 GBP","JE:4.5 GBP","KE:6.5 GBP","KR:6.5 GBP","KW:6.5 GBP","LV:7 GBP","LI:6.5 GBP","LT:7 GBP","LU:7 GBP","MY:6.5 GBP","MT:7 GBP","MU:6.5 GBP","MX:6.5 GBP","MC:6.5 GBP","NC:6.5 GBP","NF:6.5 GBP","OM:6.5 GBP","PH:6.5 GBP","PL:7 GBP","QA:6.5 GBP","RO:7 GBP","SM:6.5 GBP","SA:6.5 GBP","SN:6.5 GBP","RS:6.5 GBP","SG:6.5 GBP","SK:7 GBP","SI:7 GBP","LK:6.5 GBP","TW:6.5 GBP","TH:6.5 GBP","TR:6.5 GBP","AE:6.5 GBP","UM:6.5 GBP","UY:6.5 GBP"
4700298,4700298,"Metallic helix foliage set","A bundle to give your ward robe an instant update , to be worn together or wioth other pieces in your wardrobe. Sustainable fashion at iots best","100 GBP",,,,https://atheleisurecs.teemill.com/product/metallic-helix-foliage-set/?currency=GBP,yes,new,https://images.teemill.com/2ews5sfcevmlptwbe3s6gkvb3fgkenloxrtapuvf7iqxfzgi.png.jpg?w=auto&h=auto,,BUNDLE-4700298,AtheleisureCS,female,,Adult,"Clothing & Accessories > Clothing","Printed T-shirt > Female > Pack > AtheleisureCS","in stock",,,,"Female - Printed T-shirt",1,0,1,,"US:6.5 GBP","CA:6.5 GBP","AU:6.5 GBP","FR:7 GBP","DE:7 GBP","IS:6.5 GBP","IE:7 GBP","IT:7 GBP","ES:7 GBP","SE:7 GBP","AT:7 GBP","BE:7 GBP","FI:7 GBP","CZ:7 GBP","DK:7 GBP","NO:6.5 GBP","GB:0.00 GBP","CH:6.5 GBP","NZ:6.5 GBP","PT:7 GBP","NL:7 GBP","IM:4.5 GBP","DZ:6.5 GBP","AD:6.5 GBP","AR:6.5 GBP","AM:6.5 GBP","BH:6.5 GBP","BD:6.5 GBP","BM:6.5 GBP","BG:7 GBP","CV:6.5 GBP","CL:6.5 GBP","CN:6.5 GBP","CR:6.5 GBP","HR:7 GBP","CY:7 GBP","EG:6.5 GBP","EE:7 GBP","FK:6.5 GBP","FO:6.5 GBP","GE:6.5 GBP","GI:6.5 GBP","GR:7 GBP","GL:6.5 GBP","GG:4.5 GBP","HK:6.5 GBP","HU:7 GBP","IN:6.5 GBP","ID:6.5 GBP","IL:6.5 GBP","JP:6.5 GBP","JE:4.5 GBP","KE:6.5 GBP","KR:6.5 GBP","KW:6.5 GBP","LV:7 GBP","LI:6.5 GBP","LT:7 GBP","LU:7 GBP","MY:6.5 GBP","MT:7 GBP","MU:6.5 GBP","MX:6.5 GBP","MC:6.5 GBP","NC:6.5 GBP","NF:6.5 GBP","OM:6.5 GBP","PH:6.5 GBP","PL:7 GBP","QA:6.5 GBP","RO:7 GBP","SM:6.5 GBP","SA:6.5 GBP","SN:6.5 GBP","RS:6.5 GBP","SG:6.5 GBP","SK:7 GBP","SI:7 GBP","LK:6.5 GBP","TW:6.5 GBP","TH:6.5 GBP","TR:6.5 GBP","AE:6.5 GBP","UM:6.5 GBP","UY:6.5 GBP"
4700308,4700308,"Gifting bundle","A perfect gifting bundle all in one either to yourself or your best friends or family after all its the season for giving and sharing","140 GBP",,,,https://atheleisurecs.teemill.com/product/gifting-bundle/?currency=GBP,yes,new,https://images.teemill.com/nliitpkajshx2cyqxhm478miav26yi0e1aeorbbcdmztxcht.png.jpg?w=auto&h=auto,,BUNDLE-4700308,AtheleisureCS,female,,Adult,"Clothing & Accessories > Clothing","Printed T-shirt > Female > Pack > AtheleisureCS","in stock",,,,"Female - Printed T-shirt",1,0,1,,"US:6.5 GBP","CA:6.5 GBP","AU:6.5 GBP","FR:7 GBP","DE:7 GBP","IS:6.5 GBP","IE:7 GBP","IT:7 GBP","ES:7 GBP","SE:7 GBP","AT:7 GBP","BE:7 GBP","FI:7 GBP","CZ:7 GBP","DK:7 GBP","NO:6.5 GBP","GB:0.00 GBP","CH:6.5 GBP","NZ:6.5 GBP","PT:7 GBP","NL:7 GBP","IM:4.5 GBP","DZ:6.5 GBP","AD:6.5 GBP","AR:6.5 GBP","AM:6.5 GBP","BH:6.5 GBP","BD:6.5 GBP","BM:6.5 GBP","BG:7 GBP","CV:6.5 GBP","CL:6.5 GBP","CN:6.5 GBP","CR:6.5 GBP","HR:7 GBP","CY:7 GBP","EG:6.5 GBP","EE:7 GBP","FK:6.5 GBP","FO:6.5 GBP","GE:6.5 GBP","GI:6.5 GBP","GR:7 GBP","GL:6.5 GBP","GG:4.5 GBP","HK:6.5 GBP","HU:7 GBP","IN:6.5 GBP","ID:6.5 GBP","IL:6.5 GBP","JP:6.5 GBP","JE:4.5 GBP","KE:6.5 GBP","KR:6.5 GBP","KW:6.5 GBP","LV:7 GBP","LI:6.5 GBP","LT:7 GBP","LU:7 GBP","MY:6.5 GBP","MT:7 GBP","MU:6.5 GBP","MX:6.5 GBP","MC:6.5 GBP","NC:6.5 GBP","NF:6.5 GBP","OM:6.5 GBP","PH:6.5 GBP","PL:7 GBP","QA:6.5 GBP","RO:7 GBP","SM:6.5 GBP","SA:6.5 GBP","SN:6.5 GBP","RS:6.5 GBP","SG:6.5 GBP","SK:7 GBP","SI:7 GBP","LK:6.5 GBP","TW:6.5 GBP","TH:6.5 GBP","TR:6.5 GBP","AE:6.5 GBP","UM:6.5 GBP","UY:6.5 GBP"
42292351,4696912,"Survivor long T-Shirt","Bring something new to your day with this amazing Survivor long T-Shirt. With this epic print on our classic t-shirt, you can elevate your wardrobe to the next level. And even better, we only use natural materials in our products and renewable energy is used throughout our supply chain.  Order yours before 1pm today for rapid delivery when you choose Priority shipping (UK only).","19 GBP",,Black,XS,https://atheleisurecs.teemill.com/product/survivor-long-t-shirt/Black/?currency=GBP&options[]=Size:XS,no,new,https://images.teemill.com/utd7qb1cnli5ngik6lucotq5n2zwlexby0m6gx6xwe7vfwvi.png.jpg?w=auto&h=auto,https://images.teemill.com/utd7qb1cnli5ngik6lucotq5n2zwlexby0m6gx6xwe7vfwvi.png.jpg?w=auto&h=auto,DIY-4696912,AtheleisureCS,male,"Certified Organic Cotton",Adult,"Clothing & Accessories > Clothing > Shirts & Tops","Printed T-shirt > Male > Non-Pack > AtheleisureCS > Black > Certified Organic Cotton > XS","in stock",,,regular,"Male - Printed T-shirt",1,0,0,,"US:6.5 GBP","CA:6.5 GBP","AU:6.5 GBP","FR:7 GBP","DE:7 GBP","IS:6.5 GBP","IE:7 GBP","IT:7 GBP","ES:7 GBP","SE:7 GBP","AT:7 GBP","BE:7 GBP","FI:7 GBP","CZ:7 GBP","DK:7 GBP","NO:6.5 GBP","GB:4.5 GBP","CH:6.5 GBP","NZ:6.5 GBP","PT:7 GBP","NL:7 GBP","IM:4.5 GBP","DZ:6.5 GBP","AD:6.5 GBP","AR:6.5 GBP","AM:6.5 GBP","BH:6.5 GBP","BD:6.5 GBP","BM:6.5 GBP","BG:7 GBP","CV:6.5 GBP","CL:6.5 GBP","CN:6.5 GBP","CR:6.5 GBP","HR:7 GBP","CY:7 GBP","EG:6.5 GBP","EE:7 GBP","FK:6.5 GBP","FO:6.5 GBP","GE:6.5 GBP","GI:6.5 GBP","GR:7 GBP","GL:6.5 GBP","GG:4.5 GBP","HK:6.5 GBP","HU:7 GBP","IN:6.5 GBP","ID:6.5 GBP","IL:6.5 GBP","JP:6.5 GBP","JE:4.5 GBP","KE:6.5 GBP","KR:6.5 GBP","KW:6.5 GBP","LV:7 GBP","LI:6.5 GBP","LT:7 GBP","LU:7 GBP","MY:6.5 GBP","MT:7 GBP","MU:6.5 GBP","MX:6.5 GBP","MC:6.5 GBP","NC:6.5 GBP","NF:6.5 GBP","OM:6.5 GBP","PH:6.5 GBP","PL:7 GBP","QA:6.5 GBP","RO:7 GBP","SM:6.5 GBP","SA:6.5 GBP","SN:6.5 GBP","RS:6.5 GBP","SG:6.5 GBP","SK:7 GBP","SI:7 GBP","LK:6.5 GBP","TW:6.5 GBP","TH:6.5 GBP","TR:6.5 GBP","AE:6.5 GBP","UM:6.5 GBP","UY:6.5 GBP"
42292352,4696912,"Survivor long T-Shirt","Bring something new to your day with this amazing Survivor long T-Shirt. With this epic print on our classic t-shirt, you can elevate your wardrobe to the next level. And even better, we only use natural materials in our products and renewable energy is used throughout our supply chain.  Order yours before 1pm today for rapid delivery when you choose Priority shipping (UK only).","19 GBP",,White,XS,https://atheleisurecs.teemill.com/product/survivor-long-t-shirt/White/?currency=GBP&options[]=Size:XS,no,new,https://images.teemill.com/utd7qb1cnli5ngik6lucotq5n2zwlexby0m6gx6xwe7vfwvi.png.jpg?w=auto&h=auto,https://images.teemill.com/utd7qb1cnli5ngik6lucotq5n2zwlexby0m6gx6xwe7vfwvi.png.jpg?w=auto&h=auto,DIY-4696912,AtheleisureCS,male,"Certified Organic Cotton",Adult,"Clothing & Accessories > Clothing > Shirts & Tops","Printed T-shirt > Male > Non-Pack > AtheleisureCS > White > Certified Organic Cotton > XS","in stock",,,regular,"Male - Printed T-shirt",1,0,0,,"US:6.5 GBP","CA:6.5 GBP","AU:6.5 GBP","FR:7 GBP","DE:7 GBP","IS:6.5 GBP","IE:7 GBP","IT:7 GBP","ES:7 GBP","SE:7 GBP","AT:7 GBP","BE:7 GBP","FI:7 GBP","CZ:7 GBP","DK:7 GBP","NO:6.5 GBP","GB:4.5 GBP","CH:6.5 GBP","NZ:6.5 GBP","PT:7 GBP","NL:7 GBP","IM:4.5 GBP","DZ:6.5 GBP","AD:6.5 GBP","AR:6.5 GBP","AM:6.5 GBP","BH:6.5 GBP","BD:6.5 GBP","BM:6.5 GBP","BG:7 GBP","CV:6.5 GBP","CL:6.5 GBP","CN:6.5 GBP","CR:6.5 GBP","HR:7 GBP","CY:7 GBP","EG:6.5 GBP","EE:7 GBP","FK:6.5 GBP","FO:6.5 GBP","GE:6.5 GBP","GI:6.5 GBP","GR:7 GBP","GL:6.5 GBP","GG:4.5 GBP","HK:6.5 GBP","HU:7 GBP","IN:6.5 GBP","ID:6.5 GBP","IL:6.5 GBP","JP:6.5 GBP","JE:4.5 GBP","KE:6.5 GBP","KR:6.5 GBP","KW:6.5 GBP","LV:7 GBP","LI:6.5 GBP","LT:7 GBP","LU:7 GBP","MY:6.5 GBP","MT:7 GBP","MU:6.5 GBP","MX:6.5 GBP","MC:6.5 GBP","NC:6.5 GBP","NF:6.5 GBP","OM:6.5 GBP","PH:6.5 GBP","PL:7 GBP","QA:6.5 GBP","RO:7 GBP","SM:6.5 GBP","SA:6.5 GBP","SN:6.5 GBP","RS:6.5 GBP","SG:6.5 GBP","SK:7 GBP","SI:7 GBP","LK:6.5 GBP","TW:6.5 GBP","TH:6.5 GBP","TR:6.5 GBP","AE:6.5 GBP","UM:6.5 GBP","UY:6.5 GBP"
42292354,4696912,"Survivor long T-Shirt","Bring something new to your day with this amazing Survivor long T-Shirt. With this epic print on our classic t-shirt, you can elevate your wardrobe to the next level. And even better, we only use natural materials in our products and renewable energy is used throughout our supply chain.  Order yours before 1pm today for rapid delivery when you choose Priority shipping (UK only).","19 GBP",,Black,S,https://atheleisurecs.teemill.com/product/survivor-long-t-shirt/Black/?currency=GBP&options[]=Size:S,no,new,https://images.teemill.com/utd7qb1cnli5ngik6lucotq5n2zwlexby0m6gx6xwe7vfwvi.png.jpg?w=auto&h=auto,https://images.teemill.com/utd7qb1cnli5ngik6lucotq5n2zwlexby0m6gx6xwe7vfwvi.png.jpg?w=auto&h=auto,DIY-4696912,AtheleisureCS,male,"Certified Organic Cotton",Adult,"Clothing & Accessories > Clothing > Shirts & Tops","Printed T-shirt > Male > Non-Pack > AtheleisureCS > Black > Certified Organic Cotton > S","in stock",,,regular,"Male - Printed T-shirt",1,0,0,,"US:6.5 GBP","CA:6.5 GBP","AU:6.5 GBP","FR:7 GBP","DE:7 GBP","IS:6.5 GBP","IE:7 GBP","IT:7 GBP","ES:7 GBP","SE:7 GBP","AT:7 GBP","BE:7 GBP","FI:7 GBP","CZ:7 GBP","DK:7 GBP","NO:6.5 GBP","GB:4.5 GBP","CH:6.5 GBP","NZ:6.5 GBP","PT:7 GBP","NL:7 GBP","IM:4.5 GBP","DZ:6.5 GBP","AD:6.5 GBP","AR:6.5 GBP","AM:6.5 GBP","BH:6.5 GBP","BD:6.5 GBP","BM:6.5 GBP","BG:7 GBP","CV:6.5 GBP","CL:6.5 GBP","CN:6.5 GBP","CR:6.5 GBP","HR:7 GBP","CY:7 GBP","EG:6.5 GBP","EE:7 GBP","FK:6.5 GBP","FO:6.5 GBP","GE:6.5 GBP","GI:6.5 GBP","GR:7 GBP","GL:6.5 GBP","GG:4.5 GBP","HK:6.5 GBP","HU:7 GBP","IN:6.5 GBP","ID:6.5 GBP","IL:6.5 GBP","JP:6.5 GBP","JE:4.5 GBP","KE:6.5 GBP","KR:6.5 GBP","KW:6.5 GBP","LV:7 GBP","LI:6.5 GBP","LT:7 GBP","LU:7 GBP","MY:6.5 GBP","MT:7 GBP","MU:6.5 GBP","MX:6.5 GBP","MC:6.5 GBP","NC:6.5 GBP","NF:6.5 GBP","OM:6.5 GBP","PH:6.5 GBP","PL:7 GBP","QA:6.5 GBP","RO:7 GBP","SM:6.5 GBP","SA:6.5 GBP","SN:6.5 GBP","RS:6.5 GBP","SG:6.5 GBP","SK:7 GBP","SI:7 GBP","LK:6.5 GBP","TW:6.5 GBP","TH:6.5 GBP","TR:6.5 GBP","AE:6.5 GBP","UM:6.5 GBP","UY:6.5 GBP"
42292355,4696912,"Survivor long T-Shirt","Bring something new to your day with this amazing Survivor long T-Shirt. With this epic print on our classic t-shirt, you can elevate your wardrobe to the next level. And even better, we only use natural materials in our products and renewable energy is used throughout our supply chain.  Order yours before 1pm today for rapid delivery when you choose Priority shipping (UK only).","19 GBP",,White,S,https://atheleisurecs.teemill.com/product/survivor-long-t-shirt/White/?currency=GBP&options[]=Size:S,no,new,https://images.teemill.com/utd7qb1cnli5ngik6lucotq5n2zwlexby0m6gx6xwe7vfwvi.png.jpg?w=auto&h=auto,https://images.teemill.com/utd7qb1cnli5ngik6lucotq5n2zwlexby0m6gx6xwe7vfwvi.png.jpg?w=auto&h=auto,DIY-4696912,AtheleisureCS,male,"Certified Organic Cotton",Adult,"Clothing & Accessories > Clothing > Shirts & Tops","Printed T-shirt > Male > Non-Pack > AtheleisureCS > White > Certified Organic Cotton > S","in stock",,,regular,"Male - Printed T-shirt",1,0,0,,"US:6.5 GBP","CA:6.5 GBP","AU:6.5 GBP","FR:7 GBP","DE:7 GBP","IS:6.5 GBP","IE:7 GBP","IT:7 GBP","ES:7 GBP","SE:7 GBP","AT:7 GBP","BE:7 GBP","FI:7 GBP","CZ:7 GBP","DK:7 GBP","NO:6.5 GBP","GB:4.5 GBP","CH:6.5 GBP","NZ:6.5 GBP","PT:7 GBP","NL:7 GBP","IM:4.5 GBP","DZ:6.5 GBP","AD:6.5 GBP","AR:6.5 GBP","AM:6.5 GBP","BH:6.5 GBP","BD:6.5 GBP","BM:6.5 GBP","BG:7 GBP","CV:6.5 GBP","CL:6.5 GBP","CN:6.5 GBP","CR:6.5 GBP","HR:7 GBP","CY:7 GBP","EG:6.5 GBP","EE:7 GBP","FK:6.5 GBP","FO:6.5 GBP","GE:6.5 GBP","GI:6.5 GBP","GR:7 GBP","GL:6.5 GBP","GG:4.5 GBP","HK:6.5 GBP","HU:7 GBP","IN:6.5 GBP","ID:6.5 GBP","IL:6.5 GBP","JP:6.5 GBP","JE:4.5 GBP","KE:6.5 GBP","KR:6.5 GBP","KW:6.5 GBP","LV:7 GBP","LI:6.5 GBP","LT:7 GBP","LU:7 GBP","MY:6.5 GBP","MT:7 GBP","MU:6.5 GBP","MX:6.5 GBP","MC:6.5 GBP","NC:6.5 GBP","NF:6.5 GBP","OM:6.5 GBP","PH:6.5 GBP","PL:7 GBP","QA:6.5 GBP","RO:7 GBP","SM:6.5 GBP","SA:6.5 GBP","SN:6.5 GBP","RS:6.5 GBP","SG:6.5 GBP","SK:7 GBP","SI:7 GBP","LK:6.5 GBP","TW:6.5 GBP","TH:6.5 GBP","TR:6.5 GBP","AE:6.5 GBP","UM:6.5 GBP","UY:6.5 GBP"
42292356,4696912,"Survivor long T-Shirt","Bring something new to your day with this amazing Survivor long T-Shirt. With this epic print on our classic t-shirt, you can elevate your wardrobe to the next level. And even better, we only use natural materials in our products and renewable energy is used throughout our supply chain.  Order yours before 1pm today for rapid delivery when you choose Priority shipping (UK only).","19 GBP",,Black,M,https://atheleisurecs.teemill.com/product/survivor-long-t-shirt/Black/?currency=GBP&options[]=Size:M,no,new,https://images.teemill.com/utd7qb1cnli5ngik6lucotq5n2zwlexby0m6gx6xwe7vfwvi.png.jpg?w=auto&h=auto,https://images.teemill.com/utd7qb1cnli5ngik6lucotq5n2zwlexby0m6gx6xwe7vfwvi.png.jpg?w=auto&h=auto,DIY-4696912,AtheleisureCS,male,"Certified Organic Cotton",Adult,"Clothing & Accessories > Clothing > Shirts & Tops","Printed T-shirt > Male > Non-Pack > AtheleisureCS > Black > Certified Organic Cotton > M","in stock",,,regular,"Male - Printed T-shirt",1,0,0,,"US:6.5 GBP","CA:6.5 GBP","AU:6.5 GBP","FR:7 GBP","DE:7 GBP","IS:6.5 GBP","IE:7 GBP","IT:7 GBP","ES:7 GBP","SE:7 GBP","AT:7 GBP","BE:7 GBP","FI:7 GBP","CZ:7 GBP","DK:7 GBP","NO:6.5 GBP","GB:4.5 GBP","CH:6.5 GBP","NZ:6.5 GBP","PT:7 GBP","NL:7 GBP","IM:4.5 GBP","DZ:6.5 GBP","AD:6.5 GBP","AR:6.5 GBP","AM:6.5 GBP","BH:6.5 GBP","BD:6.5 GBP","BM:6.5 GBP","BG:7 GBP","CV:6.5 GBP","CL:6.5 GBP","CN:6.5 GBP","CR:6.5 GBP","HR:7 GBP","CY:7 GBP","EG:6.5 GBP","EE:7 GBP","FK:6.5 GBP","FO:6.5 GBP","GE:6.5 GBP","GI:6.5 GBP","GR:7 GBP","GL:6.5 GBP","GG:4.5 GBP","HK:6.5 GBP","HU:7 GBP","IN:6.5 GBP","ID:6.5 GBP","IL:6.5 GBP","JP:6.5 GBP","JE:4.5 GBP","KE:6.5 GBP","KR:6.5 GBP","KW:6.5 GBP","LV:7 GBP","LI:6.5 GBP","LT:7 GBP","LU:7 GBP","MY:6.5 GBP","MT:7 GBP","MU:6.5 GBP","MX:6.5 GBP","MC:6.5 GBP","NC:6.5 GBP","NF:6.5 GBP","OM:6.5 GBP","PH:6.5 GBP","PL:7 GBP","QA:6.5 GBP","RO:7 GBP","SM:6.5 GBP","SA:6.5 GBP","SN:6.5 GBP","RS:6.5 GBP","SG:6.5 GBP","SK:7 GBP","SI:7 GBP","LK:6.5 GBP","TW:6.5 GBP","TH:6.5 GBP","TR:6.5 GBP","AE:6.5 GBP","UM:6.5 GBP","UY:6.5 GBP"
42292357,4696912,"Survivor long T-Shirt","Bring something new to your day with this amazing Survivor long T-Shirt. With this epic print on our classic t-shirt, you can elevate your wardrobe to the next level. And even better, we only use natural materials in our products and renewable energy is used throughout our supply chain.  Order yours before 1pm today for rapid delivery when you choose Priority shipping (UK only).","19 GBP",,White,M,https://atheleisurecs.teemill.com/product/survivor-long-t-shirt/White/?currency=GBP&options[]=Size:M,no,new,https://images.teemill.com/utd7qb1cnli5ngik6lucotq5n2zwlexby0m6gx6xwe7vfwvi.png.jpg?w=auto&h=auto,https://images.teemill.com/utd7qb1cnli5ngik6lucotq5n2zwlexby0m6gx6xwe7vfwvi.png.jpg?w=auto&h=auto,DIY-4696912,AtheleisureCS,male,"Certified Organic Cotton",Adult,"Clothing & Accessories > Clothing > Shirts & Tops","Printed T-shirt > Male > Non-Pack > AtheleisureCS > White > Certified Organic Cotton > M","in stock",,,regular,"Male - Printed T-shirt",1,0,0,,"US:6.5 GBP","CA:6.5 GBP","AU:6.5 GBP","FR:7 GBP","DE:7 GBP","IS:6.5 GBP","IE:7 GBP","IT:7 GBP","ES:7 GBP","SE:7 GBP","AT:7 GBP","BE:7 GBP","FI:7 GBP","CZ:7 GBP","DK:7 GBP","NO:6.5 GBP","GB:4.5 GBP","CH:6.5 GBP","NZ:6.5 GBP","PT:7 GBP","NL:7 GBP","IM:4.5 GBP","DZ:6.5 GBP","AD:6.5 GBP","AR:6.5 GBP","AM:6.5 GBP","BH:6.5 GBP","BD:6.5 GBP","BM:6.5 GBP","BG:7 GBP","CV:6.5 GBP","CL:6.5 GBP","CN:6.5 GBP","CR:6.5 GBP","HR:7 GBP","CY:7 GBP","EG:6.5 GBP","EE:7 GBP","FK:6.5 GBP","FO:6.5 GBP","GE:6.5 GBP","GI:6.5 GBP","GR:7 GBP","GL:6.5 GBP","GG:4.5 GBP","HK:6.5 GBP","HU:7 GBP","IN:6.5 GBP","ID:6.5 GBP","IL:6.5 GBP","JP:6.5 GBP","JE:4.5 GBP","KE:6.5 GBP","KR:6.5 GBP","KW:6.5 GBP","LV:7 GBP","LI:6.5 GBP","LT:7 GBP","LU:7 GBP","MY:6.5 GBP","MT:7 GBP","MU:6.5 GBP","MX:6.5 GBP","MC:6.5 GBP","NC:6.5 GBP","NF:6.5 GBP","OM:6.5 GBP","PH:6.5 GBP","PL:7 GBP","QA:6.5 GBP","RO:7 GBP","SM:6.5 GBP","SA:6.5 GBP","SN:6.5 GBP","RS:6.5 GBP","SG:6.5 GBP","SK:7 GBP","SI:7 GBP","LK:6.5 GBP","TW:6.5 GBP","TH:6.5 GBP","TR:6.5 GBP","AE:6.5 GBP","UM:6.5 GBP","UY:6.5 GBP"
42292358,4696912,"Survivor long T-Shirt","Bring something new to your day with this amazing Survivor long T-Shirt. With this epic print on our classic t-shirt, you can elevate your wardrobe to the next level. And even better, we only use natural materials in our products and renewable energy is used throughout our supply chain.  Order yours before 1pm today for rapid delivery when you choose Priority shipping (UK only).","19 GBP",,Black,L,https://atheleisurecs.teemill.com/product/survivor-long-t-shirt/Black/?currency=GBP&options[]=Size:L,no,new,https://images.teemill.com/utd7qb1cnli5ngik6lucotq5n2zwlexby0m6gx6xwe7vfwvi.png.jpg?w=auto&h=auto,https://images.teemill.com/utd7qb1cnli5ngik6lucotq5n2zwlexby0m6gx6xwe7vfwvi.png.jpg?w=auto&h=auto,DIY-4696912,AtheleisureCS,male,"Certified Organic Cotton",Adult,"Clothing & Accessories > Clothing > Shirts & Tops","Printed T-shirt > Male > Non-Pack > AtheleisureCS > Black > Certified Organic Cotton > L","in stock",,,regular,"Male - Printed T-shirt",1,0,0,,"US:6.5 GBP","CA:6.5 GBP","AU:6.5 GBP","FR:7 GBP","DE:7 GBP","IS:6.5 GBP","IE:7 GBP","IT:7 GBP","ES:7 GBP","SE:7 GBP","AT:7 GBP","BE:7 GBP","FI:7 GBP","CZ:7 GBP","DK:7 GBP","NO:6.5 GBP","GB:4.5 GBP","CH:6.5 GBP","NZ:6.5 GBP","PT:7 GBP","NL:7 GBP","IM:4.5 GBP","DZ:6.5 GBP","AD:6.5 GBP","AR:6.5 GBP","AM:6.5 GBP","BH:6.5 GBP","BD:6.5 GBP","BM:6.5 GBP","BG:7 GBP","CV:6.5 GBP","CL:6.5 GBP","CN:6.5 GBP","CR:6.5 GBP","HR:7 GBP","CY:7 GBP","EG:6.5 GBP","EE:7 GBP","FK:6.5 GBP","FO:6.5 GBP","GE:6.5 GBP","GI:6.5 GBP","GR:7 GBP","GL:6.5 GBP","GG:4.5 GBP","HK:6.5 GBP","HU:7 GBP","IN:6.5 GBP","ID:6.5 GBP","IL:6.5 GBP","JP:6.5 GBP","JE:4.5 GBP","KE:6.5 GBP","KR:6.5 GBP","KW:6.5 GBP","LV:7 GBP","LI:6.5 GBP","LT:7 GBP","LU:7 GBP","MY:6.5 GBP","MT:7 GBP","MU:6.5 GBP","MX:6.5 GBP","MC:6.5 GBP","NC:6.5 GBP","NF:6.5 GBP","OM:6.5 GBP","PH:6.5 GBP","PL:7 GBP","QA:6.5 GBP","RO:7 GBP","SM:6.5 GBP","SA:6.5 GBP","SN:6.5 GBP","RS:6.5 GBP","SG:6.5 GBP","SK:7 GBP","SI:7 GBP","LK:6.5 GBP","TW:6.5 GBP","TH:6.5 GBP","TR:6.5 GBP","AE:6.5 GBP","UM:6.5 GBP","UY:6.5 GBP"
42292359,4696912,"Survivor long T-Shirt","Bring something new to your day with this amazing Survivor long T-Shirt. With this epic print on our classic t-shirt, you can elevate your wardrobe to the next level. And even better, we only use natural materials in our products and renewable energy is used throughout our supply chain.  Order yours before 1pm today for rapid delivery when you choose Priority shipping (UK only).","19 GBP",,White,L,https://atheleisurecs.teemill.com/product/survivor-long-t-shirt/White/?currency=GBP&options[]=Size:L,no,new,https://images.teemill.com/utd7qb1cnli5ngik6lucotq5n2zwlexby0m6gx6xwe7vfwvi.png.jpg?w=auto&h=auto,https://images.teemill.com/utd7qb1cnli5ngik6lucotq5n2zwlexby0m6gx6xwe7vfwvi.png.jpg?w=auto&h=auto,DIY-4696912,AtheleisureCS,male,"Certified Organic Cotton",Adult,"Clothing & Accessories > Clothing > Shirts & Tops","Printed T-shirt > Male > Non-Pack > AtheleisureCS > White > Certified Organic Cotton > L","in stock",,,regular,"Male - Printed T-shirt",1,0,0,,"US:6.5 GBP","CA:6.5 GBP","AU:6.5 GBP","FR:7 GBP","DE:7 GBP","IS:6.5 GBP","IE:7 GBP","IT:7 GBP","ES:7 GBP","SE:7 GBP","AT:7 GBP","BE:7 GBP","FI:7 GBP","CZ:7 GBP","DK:7 GBP","NO:6.5 GBP","GB:4.5 GBP","CH:6.5 GBP","NZ:6.5 GBP","PT:7 GBP","NL:7 GBP","IM:4.5 GBP","DZ:6.5 GBP","AD:6.5 GBP","AR:6.5 GBP","AM:6.5 GBP","BH:6.5 GBP","BD:6.5 GBP","BM:6.5 GBP","BG:7 GBP","CV:6.5 GBP","CL:6.5 GBP","CN:6.5 GBP","CR:6.5 GBP","HR:7 GBP","CY:7 GBP","EG:6.5 GBP","EE:7 GBP","FK:6.5 GBP","FO:6.5 GBP","GE:6.5 GBP","GI:6.5 GBP","GR:7 GBP","GL:6.5 GBP","GG:4.5 GBP","HK:6.5 GBP","HU:7 GBP","IN:6.5 GBP","ID:6.5 GBP","IL:6.5 GBP","JP:6.5 GBP","JE:4.5 GBP","KE:6.5 GBP","KR:6.5 GBP","KW:6.5 GBP","LV:7 GBP","LI:6.5 GBP","LT:7 GBP","LU:7 GBP","MY:6.5 GBP","MT:7 GBP","MU:6.5 GBP","MX:6.5 GBP","MC:6.5 GBP","NC:6.5 GBP","NF:6.5 GBP","OM:6.5 GBP","PH:6.5 GBP","PL:7 GBP","QA:6.5 GBP","RO:7 GBP","SM:6.5 GBP","SA:6.5 GBP","SN:6.5 GBP","RS:6.5 GBP","SG:6.5 GBP","SK:7 GBP","SI:7 GBP","LK:6.5 GBP","TW:6.5 GBP","TH:6.5 GBP","TR:6.5 GBP","AE:6.5 GBP","UM:6.5 GBP","UY:6.5 GBP"